Credit Counseling Waiver
type: Class
alternative label: 信用咨询豁免
subclass of: R8zijLH2GH0SxOhIdzeDOs3
definition: A Credit Counseling Waiver is a legal document that allows an individual to waive the requirement of credit counseling before filing for bankruptcy or restructuring.