Visitation Rights of Sibling
type: Class
alternative label: 兄弟姐妹探视权
subclass of: R35r4BLfUtdWKiWx1XY1z0
definition: The Visitation Rights of Sibling refer to the legal entitlement of a brother or sister to spend time with their sibling who is under the custody of one or both parents, and the legal procedures and rights involved in such visitation.