Buy Back Option Clause
type: Class
alternative label: 回购选择条款
subclass of: RDe0RKU39BlhcyACJW30ZLc
definition: A buy back option clause is a provision in a contract that allows one party to repurchase property or assets from the other party at a predetermined price and time.