Death of A Limited Partner Clause
type: Class
alternative label: 有限合伙人死亡条款
subclass of: RD3bd7cR1Bts9PPsYe8AyFi
definition: A Death of A Limited Partner Clause is a provision in a partnership agreement that outlines the procedures to be followed in the event of the death of a limited partner.