Amendment to Operating Agreement Clause
type: Class
alternative label: 修改经营协议条款
subclass of: R7UiQA8gafbU8G6XKu27y62
definition: An Amendment to Operating Agreement Clause is a provision added to an operating agreement that modifies or alters a previous clause in the agreement.