Agency Agreement
type: Class
alternative label: 代理协议
subclass of: R88D8i8AcSTUig2X3yPbFHg
definition: An agency agreement is a type of agreement between two parties where one party (the agent) is authorized to act on behalf of the other party (the principal) in certain matters, such as making contracts or managing finances.