Deceit
type: Class
alternative label: 欺骗
subclass of: R8GyyJdxlZtc7PsW9vLAKfE
definition: Deceit is a type of fraudulent claim that involves intentionally misleading or tricking someone in order to gain an advantage or cause harm.