Unjust Enrichment
type: Class
alternative label: 不当得利
subclass of: RBlW5OLfCbqfO3PmxrRqwG
subclass of: RZ1dOPJ6HH6lMJGSLNxfwV
definition: Unjust Enrichment refers to a legal claim that arises when one party has been enriched at the expense of another party, without any legal justification or basis for such enrichment, and the enriched party should therefore be required to make restitution to the other party.