Nepali
type: Class
alternative label: 尼泊尔语
subclass of: RDOvAHsvY8TKJ1O1orXPM9o
definition: Nepali (Language) is a structured system of communication consisting of grammar and vocabulary used in Nepal and some parts of India.