Bad Check Crime
type: Class
alternative label: 不良支票犯罪
subclass of: RCqBiJAwLT5iG2nvk12tNKW
definition: Knowingly and intentionally writing and/or negotiating checks drawn against insufficient or nonexistent funds.