Break Clause
type: Class
alternative label: 中止条款
subclass of: RDe0RKU39BlhcyACJW30ZLc
definition: A break clause is a provision in a contract that allows one or both parties to terminate the agreement before the end of its term.