Confidential
type: Class
preferred label: Secure Information
alternative label: Protected Data
alternative label: Restricted Information
alternative label: Sensitive Information
subclass of: R89ziIl0nXs5c4ONtS7qXTP
definition: Confidential is a security classification level used for information that requires protection because its unauthorized disclosure could cause damage to the organization (e.g., company, nation). Access to confidential information is restricted to individuals with the appropriate security clearance and a demonstrated need to know.