Intellectual Property Assets
type: Class
alternative label: 知识产权资产
subclass of: RCYl3LbuEyYdPvG9kHxRa3a
hidden label: INTPTA
definition: Intellectual property is a broad categorical description for the set of intangibles owned and legally protected by a company from outside use or implementation without consent. Intellectual property can consist of patents, trade secrets, copyrights, franchises, and trademarks or simply ideas.