Foul Ball Liability Claim
type: Class
alternative label: 犯规球责任索赔
subclass of: R8alUnZrt8GVEzHYhh1KTva
definition: A foul ball liability claim is a legal claim for damages resulting from a personal injury caused by a foul ball at a sporting event.