Currently Operative Law
type: Class
preferred label: Citator - Green Flag
alternative label: 现行法律
subclass of: RtSews3LsWL6xdoibt5V5R
definition: The law appears to have legal efficacy, operating effectively.