Georgia Superior Court - Jenkins County
type: Class
subclass of: RCBE5bLTCIia7wAstjMsnKO
definition: Georgia Superior Court - Jenkins County refers to a specific court within the Georgia Superior Court system that has jurisdiction over legal matters in Jenkins County, Georgia.