Waiver of Subrogation Clause
type: Class
alternative label: 放弃代位权条款
subclass of: Ryu5LoAUzP13SyODG4jLLN
definition: A Waiver of Subrogation Clause is a provision in a contract where one party agrees to waive their right to seek reimbursement from another party's insurance company for damages covered by the insurance policy.