Release of Obligations Clause
type: Class
alternative label: 履行豁免条款
subclass of: R7QtA1XEvYBttW8LUvBN7OB
definition: A Release of Obligations Clause is a provision in a contract that relieves one party from fulfilling certain obligations or liabilities specified in the agreement.