Awadhi
type: Class
alternative label: 阿瓦德语
subclass of: RDOvAHsvY8TKJ1O1orXPM9o
definition: Awadhi is a language that belongs to the Hindi branch of the Indo-Aryan language family and is primarily spoken in the Awadh region of Uttar Pradesh and other parts of India.