No Tax Advice Clause
type: Class
alternative label: 不提供税务建议条款
subclass of: RDe0RKU39BlhcyACJW30ZLc
definition: A "No Tax Advice Clause" is a provision in a contract that states that no tax advice has been given by one party to the other, and that each party is responsible for obtaining their own tax advice.