19th Amendment Claim
type: Class
alternative label: 第19修正案索赔
subclass of: R7MGQ9xUx0PxGLp5yxprdpZ
definition: A 19th Amendment claim is a legal assertion related to the Nineteenth Amendment of the United States Constitution, which grants citizens the right to vote regardless of sex, effectively giving women the right to vote.