Justifiable Homicide
type: Class
alternative label: 正当防卫杀人
subclass of: RBzrK4RsgfLScZvC4Z4lCCX
definition: The killing of a perpetrator of a serious criminal offense by a peace officer in the line of duty, or the killing, during the commission of a serious criminal offense, of the perpetrator by a private individual.