Arizona Superior Court - Yavapai Cty.
type: Class
subclass of: R30265408Cb3d04Ed2b2957b
definition: Arizona Superior Court - Yavapai Cty. is a specific court within the Arizona Superior Court system that has jurisdiction over legal matters within Yavapai County.