General Practitioner Malpractice
type: Class
alternative label: 全科医生过失行为
subclass of: R8nVhrBlasGIc7jxw1D0vbm
definition: Negligent or wrongful conduct by a general practitioner in the medical field, resulting in harm or injury to a patient, which may lead to a legal claim for compensation or damages.