Commercially Reasonable Efforts Antitrust Standard
type: Class
alternative label: 商业上合理努力反垄断标准
subclass of: RwjUss6QZVzUsfsKBJ0kHX
definition: The Commercially Reasonable Efforts Antitrust Standard is a provision within antitrust efforts that requires parties to make a good faith effort to achieve a particular goal or outcome, while taking into account the costs and benefits of such efforts.