Some Credible Evidence
type: Class
alternative label: 一些可信的证据
subclass of: RDV74m3ydS2I72hZ88Mf1RX
definition: Some Credible Evidence: Evidence that is trustworthy and reliable, and has the potential to persuade a fact-finder of the truth of a proposition, which is required to be presented by a party in a legal dispute in order to meet their burden of proof.