Pulmonology Malpractice
type: Class
alternative label: 肺病医疗事故
subclass of: R8nVhrBlasGIc7jxw1D0vbm
definition: Negligence or wrongdoing by a medical professional in the field of pulmonology, resulting in harm or injury to a patient.