Regulatory Services (Non-Dispute)
type: Class
alternative label: 监管服务（非争议）
subclass of: RDK1QEdQg1T8B5HQqMK2pZN
hidden label: R
definition: Any process that results in filing something with governmental entity.