Georgia Superior Court - DeKalb County
type: Class
subclass of: RCBE5bLTCIia7wAstjMsnKO
definition: The Georgia Superior Court - DeKalb County is a specific court within the Georgia Superior Court system that has jurisdiction over civil and criminal cases in DeKalb County, Georgia.