Performance Warranty Clause
type: Class
alternative label: 性能保证条款
subclass of: R8hyVs9MsMpcl891lEFtGTg
definition: A Performance Warranty Clause is a type of Warranty Clause that guarantees the quality and functionality of a product or service for a specific period of time.