By Portfolio
type: Class
alternative label: 按投资组合
subclass of: RQ69YOKe39BaW5qr4XUjYo
definition: Engagement fee model where a client pays a predetermined fee for legal services that cover two or more matters (i.e., a portfolio of matters).