Expert Fees
type: Class
alternative label: 专家费用
subclass of: R9rEOlPrMiUpUlQrMe18m1X
definition: Expert Fees refer to the costs incurred by a party in a legal matter for the services of a professional with specialized knowledge or skills, such as a medical expert or a forensic accountant.