Kansas District Court - Clay County
type: Class
subclass of: R8ahGaNbVpIwATBsrRg3EZp
definition: A court located in Clay County, Kansas that has jurisdiction over cases within its geographical boundaries.