Niger-Kordofanian languages
type: Class
alternative label: 尼日尔-科尔多凡语系
subclass of: RDOvAHsvY8TKJ1O1orXPM9o
definition: Niger-Kordofanian languages are a group of languages that belong to the Language top-level class and are spoken in West Africa.