tax segment
type: Class
subclass of: RC3hDYvR4ffxmqJg2F8YGT6
definition: "A lookup segment for the taxes charged in the file. There will be 0 or more TAX segments per file. If items are not taxed, no TAX section would be included in the file. The EXTEND_HEADER option was purposely omitted from this segment. "