Missouri Circuit Court - Schuyler County
type: Class
subclass of: RDECjssxw76vdlahxiUTb4L
definition: A Missouri Circuit Court in Schuyler County is a specific court within the Missouri Circuit Court system that has jurisdiction over legal matters within Schuyler County, Missouri.