Matter Complexity
type: Class
subclass of: R7ReDY2v13rer1U8AyOj55L
definition: Classification for a given' matter's complexity, either textually (e.g., low, medium, high) or numerically (e.g., 1 through 10).