Whistleblower Retaliation
type: Class
alternative label: 举报人报复
subclass of: R7irtksGAUxreU1oxQJBon8
subclass of: RBhkx3dQ6MLH4RmvBj4nBaz
definition: Retaliation against an employee who reports illegal or unethical behavior by their employer.