Addendum Clause
type: Class
alternative label: 补充条款
subclass of: RDe0RKU39BlhcyACJW30ZLc
definition: An addendum clause is a provision added to a contract that modifies or supplements the original terms of the agreement.