Motion to Dismiss for Failure to State a Claim
type: Class
alternative label: 未能陈述索赔的驳回动议
subclass of: R9Xkp4FqX83NG5ZI0CDfQ1k
definition: A Motion to Dismiss for Failure to State a Claim is a legal request made by a defendant to dismiss a case on the grounds that the plaintiff has failed to allege sufficient facts to support a legal claim.