L350 Discovery Motions
type: Class
subclass of: R77nPY8Gvlle6KPxDEXlNkM
definition: A legal motion made during the discovery phase of a lawsuit, specifically related to requesting information or evidence from the opposing party.