A109 Appear for/attend
type: Class
subclass of: RnTEPb LCSNqAkQqrfte8zg
definition: To "Appear for/attend" refers to the act of physically being present at a scheduled event or proceeding, such as a court hearing or meeting, as a participant or observer.