New Mexico Magistrate Court - McKinley County
type: Class
subclass of: RDSK8CbOPdmMwMyMIlw8pdO
definition: A court located in McKinley County, New Mexico that has limited jurisdiction over certain types of cases, such as traffic violations and misdemeanors.