Family Offenses - Nonviolent
type: Class
alternative label: 家庭犯罪-非暴力
subclass of: R7MbuFEaL6NyU9tM2AXk7lk
definition: Unlawful, nonviolent acts by a family member (or legal guardian) that threaten the physical, mental, or economic well-being or morals of another family member and that are not classifiable as other offenses, such as Assault, Incest, Statutory Rape, etc.