Mende
type: Class
alternative label: 门德
subclass of: RDOvAHsvY8TKJ1O1orXPM9o
definition: Mende (Language) is a structured system of communication that belongs to the Niger-Congo language family and is primarily spoken in Sierra Leone and Liberia.