Proration of Rent Clause
type: Class
alternative label: 租金比例分配条款
subclass of: RDe0RKU39BlhcyACJW30ZLc
definition: A proration of rent clause is a provision in a contract that specifies how rent will be divided and calculated when a tenant moves in or out of a property during a rental period.