pre_post_split
type: Class
subclass of: R9JDOjlrvV3jFpUOQu9WGhP
definition: "Identifies whether the disc_cred is applied before (""Pre-Split"") or after (""Post-Split) the MISF and MIDB percentages are applied to the invoice. ""NA"" (Not applicable) should be used for splits indicated by disc_cred ""MISF"" and ""MIDB"". "