Pennsylvania Municipal Court - Philadelphia County
type: Class
subclass of: RJC40G3TxG4CIj1rBvhWoF
definition: A court in Philadelphia County that handles minor criminal and traffic offenses, as well as civil cases involving amounts up to $12,000.