Indiana Superior Court - Hamilton County
type: Class
subclass of: R7uq2Mq8qLUybQoDhVczzZ5
definition: Indiana Superior Court - Hamilton County is a specific court within the Indiana Superior Court system that has jurisdiction over cases in Hamilton County, Indiana.