Habeas Corpus
type: Class
alternative label: 人身保护令
subclass of: RDbz1PVc6y57oOb9jAIl0eN
definition: A legal concept that allows a person who is detained or imprisoned to challenge the legality of their detention and seek release.